{"text_format":"1","workbook":"xlsx","n_sheets":11,"sheets":["Home","About","Project","Scoring","Results","Calculator","Chart data","How to measure","How to score crossings","Help","How the score is generated"],"not_rendered":{"charts":1,"images":22,"macros":1,"external_links":0,"defined_names":3,"comments":0,"pivot_tables":0},"unopened":[],"bounds":{"document_bytes":16777216,"sheet_cells":100000,"rows_first":2000,"rows_last":500,"rows_between":2000,"halvings":0,"cell_chars":16384,"cell_head_chars":4096},"cells_cut":0,"cells_raw":0,"read":"whole","date_system":"1900"}

{"sheet":"Home","index":0,"n_rows":25,"n_cols":13,"rows_kept":25,"cut":false,"hidden":false,"merged":[[19,11,19,12]]}
[]
[]
[]
[]
[]
[]
[]
[]
{"$rows_left_out":18}
{"sheet":"About","index":1,"n_rows":24,"n_cols":4,"rows_kept":24,"cut":false,"hidden":false,"merged":[[21,3,23,3],[18,3,19,3],[11,1,13,1],[13,3,14,3],[16,3,17,3],[1,1,2,2],[8,1,9,1],[6,1,7,1],[7,3,9,3],[10,3,11,3]]}
[]
[null,"About"]
[]
[]
[null,"What is this?"]
[null,"This is a tool for designers and engineers to make a basic assessment of a street against the 10 Healthy Streets Indicators.\n\nThe 10 Healthy Streets Indicators are the foundation of the Healthy Streets Approach. They must be prioritised and balanced to improve social, economic and environmental sustainability through how streets are designed and managed. These Indicators are the key elements of the experience on street that need to be prioritised.\n",null,"This tool does not measure the compliance of street designs with existing national or state codes. This tool measures some of the most important factors in providing a healthy environment for people walking, cycling, accessing public transport etc. It is common for existing streets to score low on this tool because they have been designed to prioritise the through-movement of vehicles which is often to the disadvantage of people walking, cycling and spending time on the street. \n"]
[null,"This Approach builds improvements on existing conditions rather than seeking a fixed end goal, and can be applied to any street, anywhere. Taking this Approach requires incremental changes in all aspects of the decision-making processes related to streets and transport.\n\nTo learn more about the Healthy Streets Approach and the range of tools available for applying this Approach visit healthystreets.com",null,"When do I use it?"]
[null,null,null,"This tool should be used when designers and engineers are in the early stages of planning design changes to a street or reviewing changes that have been made.\n\nThis is not a tool for communities to assess their local streets. If you want an easy checklist for communities to assess their streets then visit healthystreets.com/resources\n\nThis tool can be applied to an existing street and to designs for new street layouts. If you are redesigning an existing street we recommend you use this tool to assess the existing layout and use the information in the tool to create a new design that achieves a higher Healthy Streets score. If you have multiple options for a new design you can apply the tool to each option and use the score to help you decide which one you choose.\n"]
{"$rows_left_out":17}
{"sheet":"Project","index":2,"n_rows":17,"n_cols":9,"rows_kept":17,"cut":false,"hidden":false,"merged":[[1,1,2,2],[6,8,6,13],[18,1,18,6],[6,1,6,6],[18,8,18,13],[14,8,14,13],[14,1,14,6],[10,1,10,6],[10,8,10,13]]}
[]
[null,"Project"]
[]
[]
[null,"Name of checker",null,null,null,null,null,null,"Contact email address"]
[]
[]
[]
{"$rows_left_out":10}
{"sheet":"Scoring","index":3,"n_rows":26,"n_cols":11,"rows_kept":26,"cut":false,"hidden":false,"merged":[[4,10,5,10],[4,6,5,6],[4,8,5,8],[24,5,24,6],[4,2,4,5],[4,7,5,7],[4,9,5,9],[1,0,2,1],[4,0,5,1]]}
[]
["Scoring"]
[]
[]
["Metrics",null,"Score",null,null,null,"How do I measure this?","Existing layout","Notes on existing layout scores","Proposed layout","Notes on proposed layout scores"]
[null,null,3,2,1,0]
[1,"Traffic speed","For the hour when vehicle speeds are highest the 85th percentile is below 30kph\n","For the hour when vehicle speeds are highest the 85th percentile is 30-39 kph","For the hour when vehicle speeds are highest the 85th percentile is 40-49 kph","For the hour when vehicle speeds are highest the 85th percentile is 50kph or more","info"]
[2,"Volume of motorised traffic","For the hour when traffic volume is at its peak there are 199 or fewer  vehicles (both directions)\n","For the hour when traffic volume is at its peak there are 200-499 vehicles (both directions)","For the hour when traffic volume is at its peak there are 500-999 vehicles (both directions)","For the hour when traffic volume is at its peak there are 1000 or more vehicles (both directions)","info"]
{"$rows_left_out":19}
{"sheet":"Results","index":4,"n_rows":27,"n_cols":9,"rows_kept":27,"cut":false,"hidden":false,"merged":[[1,1,2,2]]}
[]
[null,"Healthy Streets Score"]
[]
[]
[null,"Name of street"]
[null,{"$f":"Project!B11","v":0}]
[]
[null,"Name of street at start intersection"]
{"$rows_left_out":20}
{"sheet":"Calculator","index":5,"n_rows":51,"n_cols":14,"rows_kept":51,"cut":false,"hidden":true,"merged":[[21,1,21,13],[47,1,47,13]]}
[]
[null,"Question","Existing Layout Score",null,"Everyone feels welcome","Easy to cross","Shade and shelter","Places to stop and rest","Not too noisy","People choose to walk and cycle","People feel safe","Things to see and do","People feel relaxed","Clean air"]
[null,{"$f":"1","v":1},{"$f":"IF(Scoring!H7<>\"\", Scoring!H7, \"-\")","v":"-"},null,{"$f":"C3","v":"-"},{"$f":"C3","v":"-"},null,null,{"$f":"C3","v":"-"},{"$f":"C3","v":"-"},{"$f":"C3","v":"-"},null,{"$f":"C3","v":"-"},{"$f":"C3","v":"-"}]
[null,{"$f":"B3+1","v":2},{"$f":"IF(Scoring!H8<>\"\", Scoring!H8, \"-\")","v":"-"},null,"-",{"$f":"C4","v":"-"},null,null,{"$f":"C4","v":"-"},"-","-",null,"-",{"$f":"C4","v":"-"}]
[null,{"$f":"B4+1","v":3},{"$f":"IF(Scoring!H9<>\"\", Scoring!H9, \"-\")","v":"-"},null,"-",{"$f":"C5","v":"-"},null,null,{"$f":"C5","v":"-"},"-","-",null,"-",{"$f":"C5","v":"-"}]
[null,4,{"$f":"IF(Scoring!H10<>\"\", Scoring!H10, \"-\")","v":"-"},null,{"$f":"C6","v":"-"},null,null,null,null,{"$f":"C6","v":"-"},{"$f":"C6","v":"-"},null,{"$f":"C6","v":"-"}]
[null,5,{"$f":"IF(Scoring!H11<>\"\", Scoring!H11, \"-\")","v":"-"},null,{"$f":"C7","v":"-"},{"$f":"C7","v":"-"},null,null,null,{"$f":"C7","v":"-"},"-",null,{"$f":"C7","v":"-"}]
[null,6,{"$f":"IF(Scoring!H12<>\"\", Scoring!H12, \"-\")","v":"-"},null,{"$f":"C8","v":"-"},{"$f":"C8","v":"-"},null,null,null,{"$f":"C8","v":"-"},"-",null,{"$f":"C8","v":"-"}]
{"$rows_left_out":44}
{"sheet":"Chart data","index":6,"n_rows":25,"n_cols":368,"rows_kept":25,"cut":false,"hidden":true,"merged":[]}
[null,"Existing Layout Score","Sector Weight","% of 360","Start Angle","Finish Angle",0,{"$f":"G1+1","v":1},2,3,4,5,6,7,8,9,10,11,12,13,14,15,16,17,18,19,20,21,22,23,24,25,26,27,28,29,30,31,32,33,34,35,36,37,38,39,40,41,42,43,44,45,46,47,48,49,50,51,52,53,54,55,56,57,58,59,60,61,62,63,64,{"$f":"BS1+1","v":65},66,67,68,69,70,71,72,73,74,75,76,77,78,79,80,81,82,83,84,85,86,87,88,89,90,91,92,93,94,95,96,97,98,99,100,101,102,103,104,105,106,107,108,109,110,111,112,113,114,115,116,117,118,119,120,121,122,123,124,125,126,127,128,{"$f":"EE1+1","v":129},130,131,132,133,134,135,136,137,138,139,140,141,142,143,144,145,146,147,148,149,150,151,152,153,154,155,156,157,158,159,160,161,162,163,164,165,166,167,168,169,170,171,172,173,174,175,176,177,178,179,180,181,182,183,184,185,186,187,188,189,190,191,192,{"$f":"GQ1+1","v":193},194,195,196,197,198,199,200,201,202,203,204,205,206,207,208,209,210,211,212,213,214,215,216,217,218,219,220,221,222,223,224,225,226,227,228,229,230,231,232,233,234,235,236,237,238,239,240,241,242,243,244,245,246,247,248,249,250,251,252,253,254,255,256,{"$f":"JC1+1","v":257},258,259,260,261,262,263,264,265,266,267,268,269,270,271,272,273,274,275,276,277,278,279,280,281,282,283,284,285,286,287,288,289,290,291,292,293,294,295,296,297,298,299,300,301,302,303,304,305,306,307,308,309,310,311,312,313,314,315,316,317,318,319,320,{"$f":"LO1+1","v":321},322,323,324,325,326,327,328,329,330,331,332,333,334,335,336,337,338,339,340,341,342,343,344,345,346,347,348,349,350,351,352,353,354,355,356,357,358,359,360,361]
["Healthy Streets Score",{"$f":"IF(Calculator!C25=0, Calculator!C24, 0)","v":0}]
["Healthy Streets Score",{"$f":"IF(Calculator!C51=0, Calculator!C50, 0)","v":0}]
["Everyone feels welcome",{"$f":"IF(Calculator!C25=0, Calculator!E24, 0)","v":0},1,{"$f":"C4/SUM($C$4:$C$23)","v":0.05},0,{"$f":"360 * SUM(D$4:D4)","v":18},{"$f":"IF(AND(G$1>=$E4,G$1<=$F4),$B4,0)","v":0},0,0,0,0,0,0,0,0,0,0,0,0,0,0,0,0,0,0,0,0,0,0,0,0,0,0,0,0,0,0,0,0,0,0,0,0,0,0,0,0,0,0,0,0,0,0,0,0,0,0,0,0,0,0,0,0,0,0,0,0,0,0,0,{"$f":"IF(AND(BS$1>=$E4,BS$1<=$F4),$B4,0)","v":0},0,0,0,0,0,0,0,0,0,0,0,0,0,0,0,0,0,0,0,0,0,0,0,0,0,0,0,0,0,0,0,0,0,0,0,0,0,0,0,0,0,0,0,0,0,0,0,0,0,0,0,0,0,0,0,0,0,0,0,0,0,0,0,{"$f":"IF(AND(EE$1>=$E4,EE$1<=$F4),$B4,0)","v":0},0,0,0,0,0,0,0,0,0,0,0,0,0,0,0,0,0,0,0,0,0,0,0,0,0,0,0,0,0,0,0,0,0,0,0,0,0,0,0,0,0,0,0,0,0,0,0,0,0,0,0,0,0,0,0,0,0,0,0,0,0,0,0,{"$f":"IF(AND(GQ$1>=$E4,GQ$1<=$F4),$B4,0)","v":0},0,0,0,0,0,0,0,0,0,0,0,0,0,0,0,0,0,0,0,0,0,0,0,0,0,0,0,0,0,0,0,0,0,0,0,0,0,0,0,0,0,0,0,0,0,0,0,0,0,0,0,0,0,0,0,0,0,0,0,0,0,0,0,{"$f":"IF(AND(JC$1>=$E4,JC$1<=$F4),$B4,0)","v":0},0,0,0,0,0,0,0,0,0,0,0,0,0,0,0,0,0,0,0,0,0,0,0,0,0,0,0,0,0,0,0,0,0,0,0,0,0,0,0,0,0,0,0,0,0,0,0,0,0,0,0,0,0,0,0,0,0,0,0,0,0,0,0,{"$f":"IF(AND(LO$1>=$E4,LO$1<=$F4),$B4,0)","v":0},0,0,0,0,0,0,0,0,0,0,0,0,0,0,0,0,0,0,0,0,0,0,0,0,0,0,0,0,0,0,0,0,0,0,0,0,0,0,0,0,0]
["Everyone feels welcome",{"$f":"IF(Calculator!C51=0, Calculator!E50, 0)","v":0},1,{"$f":"C5/SUM($C$4:$C$23)","v":0.05},{"$f":"F4","v":18},{"$f":"360 * SUM(D$4:D5)","v":36},{"$f":"IF(AND(G$1>=$E5,G$1<=$F5),$B5,0)","v":0},0,0,0,0,0,0,0,0,0,{"$f":"IF(AND(Q$1>=$E5,Q$1<=$F5),$B5,0)","v":0},0,0,0,0,0,0,0,0,0,{"$f":"IF(AND(AA$1>=$E5,AA$1<=$F5),$B5,0)","v":0},0,0,0,0,0,0,0,0,0,{"$f":"IF(AND(AK$1>=$E5,AK$1<=$F5),$B5,0)","v":0},0,0,0,0,0,0,0,0,0,{"$f":"IF(AND(AU$1>=$E5,AU$1<=$F5),$B5,0)","v":0},0,0,0,0,0,0,0,0,0,{"$f":"IF(AND(BE$1>=$E5,BE$1<=$F5),$B5,0)","v":0},0,0,0,0,0,0,0,0,0,{"$f":"IF(AND(BO$1>=$E5,BO$1<=$F5),$B5,0)","v":0},0,0,0,0,0,0,0,0,0,{"$f":"IF(AND(BY$1>=$E5,BY$1<=$F5),$B5,0)","v":0},0,0,0,0,0,0,0,0,0,{"$f":"IF(AND(CI$1>=$E5,CI$1<=$F5),$B5,0)","v":0},0,0,0,0,0,0,0,0,0,{"$f":"IF(AND(CS$1>=$E5,CS$1<=$F5),$B5,0)","v":0},0,0,0,0,0,0,0,0,0,{"$f":"IF(AND(DC$1>=$E5,DC$1<=$F5),$B5,0)","v":0},0,0,0,0,0,0,0,0,0,{"$f":"IF(AND(DM$1>=$E5,DM$1<=$F5),$B5,0)","v":0},0,0,0,0,0,0,0,0,0,{"$f":"IF(AND(DW$1>=$E5,DW$1<=$F5),$B5,0)","v":0},0,0,0,0,0,0,0,0,0,{"$f":"IF(AND(EG$1>=$E5,EG$1<=$F5),$B5,0)","v":0},0,0,0,0,0,0,0,0,0,{"$f":"IF(AND(EQ$1>=$E5,EQ$1<=$F5),$B5,0)","v":0},0,0,0,0,0,0,0,0,0,{"$f":"IF(AND(FA$1>=$E5,FA$1<=$F5),$B5,0)","v":0},0,0,0,0,0,0,0,0,0,{"$f":"IF(AND(FK$1>=$E5,FK$1<=$F5),$B5,0)","v":0},0,0,0,0,0,0,0,0,0,{"$f":"IF(AND(FU$1>=$E5,FU$1<=$F5),$B5,0)","v":0},0,0,0,0,0,0,0,0,0,{"$f":"IF(AND(GE$1>=$E5,GE$1<=$F5),$B5,0)","v":0},0,0,0,0,0,0,0,0,0,{"$f":"IF(AND(GO$1>=$E5,GO$1<=$F5),$B5,0)","v":0},0,0,0,0,0,0,0,0,0,{"$f":"IF(AND(GY$1>=$E5,GY$1<=$F5),$B5,0)","v":0},0,0,0,0,0,0,0,0,0,{"$f":"IF(AND(HI$1>=$E5,HI$1<=$F5),$B5,0)","v":0},0,0,0,0,0,0,0,0,0,{"$f":"IF(AND(HS$1>=$E5,HS$1<=$F5),$B5,0)","v":0},0,0,0,0,0,0,0,0,0,{"$f":"IF(AND(IC$1>=$E5,IC$1<=$F5),$B5,0)","v":0},0,0,0,0,0,0,0,0,0,{"$f":"IF(AND(IM$1>=$E5,IM$1<=$F5),$B5,0)","v":0},0,0,0,0,0,0,0,0,0,{"$f":"IF(AND(IW$1>=$E5,IW$1<=$F5),$B5,0)","v":0},0,0,0,0,0,0,0,0,0,{"$f":"IF(AND(JG$1>=$E5,JG$1<=$F5),$B5,0)","v":0},0,0,0,0,0,0,0,0,0,{"$f":"IF(AND(JQ$1>=$E5,JQ$1<=$F5),$B5,0)","v":0},0,0,0,0,0,0,0,0,0,{"$f":"IF(AND(KA$1>=$E5,KA$1<=$F5),$B5,0)","v":0},0,0,0,0,0,0,0,0,0,{"$f":"IF(AND(KK$1>=$E5,KK$1<=$F5),$B5,0)","v":0},0,0,0,0,0,0,0,0,0,{"$f":"IF(AND(KU$1>=$E5,KU$1<=$F5),$B5,0)","v":0},0,0,0,0,0,0,0,0,0,{"$f":"IF(AND(LE$1>=$E5,LE$1<=$F5),$B5,0)","v":0},0,0,0,0,0,0,0,0,0,{"$f":"IF(AND(LO$1>=$E5,LO$1<=$F5),$B5,0)","v":0},0,0,0,0,0,0,0,0,0,{"$f":"IF(AND(LY$1>=$E5,LY$1<=$F5),$B5,0)","v":0},0,0,0,0,0,0,0,0,0,{"$f":"IF(AND(MI$1>=$E5,MI$1<=$F5),$B5,0)","v":0},0,0,0,0,0,0,0,0,0,{"$f":"IF(AND(MS$1>=$E5,MS$1<=$F5),$B5,0)","v":0},0,0,0,0,0,0,0,0,0,0,0]
["Easy to cross",{"$f":"IF(Calculator!C25=0, Calculator!F24, 0)","v":0},1,0.05,{"$f":"F5","v":36},{"$f":"360 * SUM(D$4:D6)","v":54.000000000000007},{"$f":"IF(AND(G$1>=$E6,G$1<=$F6),$B6,0)","v":0},0,0,0,0,0,0,0,0,0,0,0,0,0,0,0,0,0,0,0,0,0,0,0,0,0,0,0,0,0,0,0,0,0,0,0,0,0,0,0,0,0,0,0,0,0,0,0,0,0,0,0,0,0,0,0,0,0,0,0,0,0,0,0,0,0,0,0,0,0,0,0,0,0,0,0,0,0,0,0,0,0,0,0,0,0,0,0,0,0,0,0,0,0,0,0,0,0,0,0,0,0,0,0,0,0,0,0,0,0,0,0,0,0,0,0,0,0,0,0,0,0,0,0,0,0,0,0,0,0,0,0,0,0,0,0,0,0,0,0,0,0,0,0,0,0,0,0,0,0,0,0,0,0,0,0,0,0,0,0,0,0,0,0,0,0,0,0,0,0,0,0,0,0,0,0,0,0,0,0,0,0,0,0,0,0,0,0,0,0,0,0,0,0,0,0,0,0,0,0,0,0,0,0,0,0,0,0,0,0,0,0,0,0,0,0,0,0,0,0,0,0,0,0,0,0,0,0,0,0,0,0,0,0,0,0,0,0,0,0,0,0,0,0,0,0,0,0,0,0,0,0,0,0,0,0,0,0,0,0,0,0,0,0,0,0,0,0,0,0,0,0,0,0,0,0,0,0,0,0,0,0,0,0,0,0,0,0,0,0,0,0,0,0,0,0,0,0,0,0,0,0,0,0,0,0,0,0,0,0,0,0,0,0,0,0,0,0,0,0,0,0,0,0,0,0,0,0,0,0,0,0,0,0,0,0,0,0,0,0,0,0,0,0,0,0,0,0,0,0,0,0,0,0,0,0,0,0,0,0,0,0]
["Easy to cross",{"$f":"IF(Calculator!C51=0, Calculator!F50, 0)","v":0},1,0.05,54.000000000000007,{"$f":"360 * SUM(D$4:D7)","v":72},0,0,0,0,0,0,0,0,0,0,0,0,0,0,0,0,0,0,0,0,0,0,0,0,0,0,0,0,0,0,0,0,0,0,0,0,0,0,0,0,0,0,0,0,0,0,0,0,0,0,0,0,0,0,0,0,0,0,0,0,0,0,0,0,0,0,0,0,0,0,0,0,0,0,0,0,0,0,0,0,0,0,0,0,0,0,0,0,0,0,0,0,0,0,0,0,0,0,0,0,0,0,0,0,0,0,0,0,0,0,0,0,0,0,0,0,0,0,0,0,0,0,0,0,0,0,0,0,0,0,0,0,0,0,0,0,0,0,0,0,0,0,0,0,0,0,0,0,0,0,0,0,0,0,0,0,0,0,0,0,0,0,0,0,0,0,0,0,0,0,0,0,0,0,0,0,0,0,0,0,0,0,0,0,0,0,0,0,0,0,0,0,0,0,0,0,0,0,0,0,0,0,0,0,0,0,0,0,0,0,0,0,0,0,0,0,0,0,0,0,0,0,0,0,0,0,0,0,0,0,0,0,0,0,0,0,0,0,0,0,0,0,0,0,0,0,0,0,0,0,0,0,0,0,0,0,0,0,0,0,0,0,0,0,0,0,0,0,0,0,0,0,0,0,0,0,0,0,0,0,0,0,0,0,0,0,0,0,0,0,0,0,0,0,0,0,0,0,0,0,0,0,0,0,0,0,0,0,0,0,0,0,0,0,0,0,0,0,0,0,0,0,0,0,0,0,0,0,0,0,0,0,0,0,0,0,0,0,0,0,0,0,0,0,0,0,0,0,0,0,0,0,0,0,0,0,0,0,0,0,0,0]
["Shade and shelter",{"$f":"IF(Calculator!C25=0, Calculator!G24, 0)","v":0},1,0.05,72,{"$f":"360 * SUM(D$4:D8)","v":90},{"$f":"IF(AND(G$1>=$E8,G$1<=$F8),$B8,0)","v":0},0,0,0,0,0,0,0,0,0,0,0,0,0,0,0,0,0,0,0,0,0,0,0,0,0,0,0,0,0,0,0,0,0,0,0,0,0,0,0,0,0,0,0,0,0,0,0,0,0,0,0,0,0,0,0,0,0,0,0,0,0,0,0,0,0,0,0,0,0,0,0,0,0,0,0,0,0,0,0,0,0,0,0,0,0,0,0,0,0,0,0,0,0,0,0,0,0,0,0,0,0,0,0,0,0,0,0,0,0,0,0,0,0,0,0,0,0,0,0,0,0,0,0,0,0,0,0,0,0,0,0,0,0,0,0,0,0,0,0,0,0,0,0,0,0,0,0,0,0,0,0,0,0,0,0,0,0,0,0,0,0,0,0,0,0,0,0,0,0,0,0,0,0,0,0,0,0,0,0,0,0,0,0,0,0,0,0,0,0,0,0,0,0,0,0,0,0,0,0,0,0,0,0,0,0,0,0,0,0,0,0,0,0,0,0,0,0,0,0,0,0,0,0,0,0,0,0,0,0,0,0,0,0,0,0,0,0,0,0,0,0,0,0,0,0,0,0,0,0,0,0,0,0,0,0,0,0,0,0,0,0,0,0,0,0,0,0,0,0,0,0,0,0,0,0,0,0,0,0,0,0,0,0,0,0,0,0,0,0,0,0,0,0,0,0,0,0,0,0,0,0,0,0,0,0,0,0,0,0,0,0,0,0,0,0,0,0,0,0,0,0,0,0,0,0,0,0,0,0,0,0,0,0,0,0,0,0,0,0,0,0,0,0,0,0,0,0,0,0,0,0,0,0,0,0,0,0,0,0,0,0]
{"$rows_left_out":18}
{"sheet":"How to measure","index":7,"n_rows":40,"n_cols":10,"rows_kept":40,"cut":false,"hidden":false,"merged":[[1,0,2,1],[4,4,4,10],[4,0,4,1],[22,2,30,2],[22,3,30,3],[22,1,30,1],[22,0,30,0],[14,0,21,0],[14,1,21,1],[14,2,21,2],[14,3,21,3],[10,3,11,3],[10,2,11,2],[10,1,11,1],[10,0,11,0],[10,4,11,10]]}
[]
["How to measure"]
[]
[]
["Metrics",null,"Why this is important","How to measure it","Additional information"]
[1,"Traffic Speed","This metric is measuring the greatest harm to people caused by motorised vehicles travelling at the highest speed they can. Vehicles travelling at higher speeds pose a danger to safety, especially of people walking, cycling and spending time on the street. They also contribute to the street feeling unsafe, unwelcoming and noisy.","For existing streets, if you have speed data for the street you are assessing then take the 85th percentile for the period when vehicles are travelling at their fastest. This is often late at night or in the early hours of the morning.\nWhere speed data is not available, for existing streets and proposed designs, make an estimate of how fast motorised vehicles could travel in the period when they can travel fastest. To make your estimate consider aspects of your street design that enable or inhibit vehicle speed such as lighting, lane widths, signage and road markings, corner radii, vertical and horizontal deflections.\n"]
[2,"Volume of motorised traffic","This metric is measuring traffic dominance which affects people through makings streets noisy, polluted, difficult to cross, intimidating and stressful to walk, cycle and spend time on.","To capture the peak impact of traffic dominance you need to use traffic counts from the period when motorised traffic levels are highest, often when congestion peaks e.g. morning rush hour. This is rarely when vehicles are travelling fastest so you should not be using data from the same time period as for metric 1.\nYour traffic count should include all motorised vehicles except electric cycles and electric scooters. Your traffic count should include all traffic passing in both directions. If the street is a one-way street then you will only have traffic passing in 1 direction.\nIf you do not have peak hour data then a broad approximation of 'vehicles per day' is that fewer than 1500 vehicles per day scores 3.\n"]
[3,"Mix of vehicles","This metric is measuring the additional harms to people which come from larger vehicles. They tend to be more polluting, noisy and dangerous and dominate the street environment contributing to it feeling stressful to walk, cycle and spend time in the street.\n","Large vehicles are those categorised as heavy vehicles, classes 3-12 in the Austroads classification system.\nPublic transport and public service vehicles should be excluded from the calculation. This is because even though larger vehicles e.g. buses have the same negative attributes as private vehicles they deliver bigger benefit in reducing reliance on private cars for personal travel."]
{"$rows_left_out":33}
{"sheet":"How to score crossings","index":8,"n_rows":62,"n_cols":6,"rows_kept":62,"cut":false,"hidden":false,"merged":[[1,0,2,2],[22,4,24,4],[20,4,21,4],[25,4,26,4],[18,4,19,4],[25,3,26,3],[25,0,26,0],[25,1,26,1],[25,2,26,2],[20,1,21,1],[20,2,21,2],[22,1,24,1],[22,2,24,2],[17,0,17,1],[18,0,24,0],[18,1,19,1],[37,1,38,1],[37,2,38,2],[37,3,38,3],[37,4,38,4],[18,5,26,5],[32,0,32,1],[33,0,43,0],[33,1,36,1],[33,2,36,2],[33,3,36,3],[33,4,36,4],[33,5,45,5],[18,2,19,2],[18,3,19,3],[20,3,21,3],[22,3,24,3],[44,3,45,3],[44,4,45,4],[39,1,43,1],[39,2,43,2],[39,3,43,3],[39,4,43,4],[51,0,51,1],[52,0,58,0],[44,0,45,0],[44,1,45,1],[44,2,45,2],[52,2,53,2],[56,1,58,1],[52,4,53,4],[52,5,60,5],[54,2,55,2],[54,3,55,3],[54,4,55,4],[56,2,58,2],[56,3,58,3],[56,4,58,4],[59,2,60,2],[59,3,60,3],[59,4,60,4],[59,0,60,0],[59,1,60,1],[54,1,55,1],[52,1,53,1],[52,3,53,3]]}
[]
["How to score crossings"]
[]
[]
[]
[]
[]
[]
{"$rows_left_out":55}
{"sheet":"Help","index":9,"n_rows":32,"n_cols":4,"rows_kept":32,"cut":false,"hidden":false,"merged":[[28,1,29,1],[21,3,23,3],[25,3,27,3],[25,1,26,1],[1,1,2,3],[14,1,17,1],[15,3,16,3],[5,3,6,3],[6,1,7,1],[19,1,21,1]]}
[]
[null,"Help"]
[]
[]
[null,"How much time does it take to use this tool?",null,"How long should a section of street be?"]
[null,"The first time you use this tool it will take you around an hour because you need to read the introduction, all of the ‘how to measure’ guidance and the help section before you get started. When you are familiar with the tool it can take around 30 minutes to complete and if you are very familiar with the street or design that you are assessing then it can take as little as 15 minutes.\n",null,"If the street you want to assess is long then you may choose to break it down into sections. Make sure that you include at least one intersection in every section of the street. There are four metrics for scoring the junctions and these must be completed to produce a Healthy Streets score.\n\nThe way that the scoring works in this tool means that it is not possible to hide weaknesses through the way the street is divided into sections. Weaknesses will either show up in one section or another.\n"]
[null,"\nHow do I measure ease of crossing?\nThere are three metrics which relate to people walking across intersections. Before you start your assessment, you may find it helpful to identify which crossings each metric applies to. Metric 5 should be applied to side-street entrances that you would cross as you walked along the footpath on one side of the street or the other. Metric 6 should be applied to crossing the carriageway of the street you are assessing between intersections. \n\nIdentify all the intersections on the street and look for the mid-block crossing between each intersection. If there is any section of the street between intersections where there is no crossing facility you score the metric 0. Metric 7 should be applied to crossing the carriageway in either direction at intersections. You need to assess every crossing point on the street at intersections and score the weakest one."]
[null,null,null,"This tool is not suitable for assessing issues above the geography of an individual street e.g. network connectivity or land use policies and practices over large areas. If you are focused on connectivity or land use then do not use this tool, instead visit healthystreets.com/resources\n\nHow do I define the walking space from the ‘buffer’ in metrics 9 and 10?\nLook at the sides of the street where the footpath is. If there is no footpath on either side of the street then score metric 9 0. If there is a footpath identify the narrowest width of this for metric 9 and then the distance from the edge of this walking space to the moving traffic as the buffer for metric 10. The buffer can include seating, bubblers, cycle parking etc."]
{"$rows_left_out":25}
{"sheet":"How the score is generated","index":10,"n_rows":24,"n_cols":12,"rows_kept":24,"cut":false,"hidden":false,"merged":[[4,0,4,1],[1,0,2,3]]}
[]
["How the score is generated"]
[]
[]
["Metric",null,"Everyone feels welcome","Easy to cross","Shade and shelter","Places to stop and rest","Not too noisy","People choose to walk and cycle","People feel safe","Things to see and do","People feel relaxed","Clean air"]
[1,"Traffic speed","•","•",null,null,"•","•","•",null,"•","•"]
[2,"Volume of motorised traffic","•","•",null,null,"•","•","•",null,"•","•"]
[3,"Mix of vehicles","•","•",null,null,"•","•","•",null,"•","•"]
{"$rows_left_out":16}